{"text_format":"1","workbook":"xlsx","n_sheets":3,"sheets":["STATEMENT","INVOICE DATA","CUSTOMER DATA"],"not_rendered":{"charts":0,"images":2,"macros":1,"external_links":0,"defined_names":11,"comments":0,"pivot_tables":0},"unopened":[],"bounds":{"document_bytes":16777216,"sheet_cells":100000,"rows_first":2000,"rows_last":500,"rows_between":2000,"halvings":0,"cell_chars":16384,"cell_head_chars":4096},"cells_cut":0,"cells_raw":0,"read":"whole","date_system":"1900"}

{"sheet":"STATEMENT","index":0,"n_rows":182,"n_cols":16,"rows_kept":182,"cut":false,"hidden":false,"merged":[[6,6,12,9],[5,6,5,9]]}
["Customer","Company D",null,null,null,null,null,null,null,null,null,-999999,"Current"]
[null,null,null,null,null,null,null,null,null,null,null,30,"30+",null,null,{"$f":"COUNTA('INVOICE DATA'!A:A)","v":5}]
[null,null,null,null,null,null,"Customer Email",null,null,"test@domain.com",null,60,"60+",null,null,{"$f":"SUM(IF(LEN(A1:A200)>1,1,0))","v":14}]
["Company Name",null,null,null,"STATEMENT",null,"Folder to Save Statements to",null,null,"C:\\",null,90,"90+"]
["Address",null,null,null,{"$f":"UPPER(TEXT(TODAY(),\"MMM DD YYYY\"))","v":"DEC 24 2019"}]
["Address 2",null,null,null,null,null,"Customer Message"]
[null,null,null,null,null,null,"Please see attached for your statement"]
[]
[{"$f":"B1","v":"Company D"}]
[{"$f":"VLOOKUP($B$1,'CUSTOMER DATA'!A:F,2,FALSE)","v":"Address Line 1"}]
[{"$f":"IF(VLOOKUP($B$1,'CUSTOMER DATA'!A:F,3,FALSE)=0,(VLOOKUP($B$1,'CUSTOMER DATA'!A:F,4,FALSE)&\", \"&VLOOKUP($B$1,'CUSTOMER DATA'!A:F,5,FALSE)&\" \"&VLOOKUP($B$1,'CUSTOMER DATA'!A:F,6,FALSE)),VLOOKUP($B$1,'CUSTOMER DATA'!A:F,3,FALSE))","v":"City, Province POSTAL CODE"}]
[{"$f":"IF(VLOOKUP($B$1,'CUSTOMER DATA'!A:F,3,FALSE)<>0,(VLOOKUP($B$1,'CUSTOMER DATA'!A:F,4,FALSE)&\", \"&VLOOKUP($B$1,'CUSTOMER DATA'!A:F,5,FALSE)&\" \"&VLOOKUP($B$1,'CUSTOMER DATA'!A:F,6,FALSE)),\"\")","v":""}]
[]
["Invoice #","Due Date","Days Past Due","Aging Category","Amount"]
[{"$f":"IFERROR(INDEX(INDIRECT(\"'INVOICE DATA'!$A$1:$A$\"&invoicecount),SMALL(IF((--(INDIRECT(\"'INVOICE DATA'!$D$1:$D$\"&invoicecount)=STATEMENT!$B$1)),ROW(INDIRECT(\"'INVOICE DATA'!$A$1:$A$\"&invoicecount)),\"\"),ROW(A1)),1),\"\")","v":126},{"$f":"IF(A15=\"\",\"\",VLOOKUP($A15,'INVOICE DATA'!$A:$D,2,FALSE))","v":"2017-05-01"},{"$f":"IF(A15=\"\",\"\",TODAY()-B15)","v":967},{"$f":"IF(A15=\"\",\"\",VLOOKUP(C15,AgingTable,2))","v":"90+"},{"$f":"IF(A15=\"\",\"\",VLOOKUP($A15,'INVOICE DATA'!$A:$D,3,FALSE))","v":40}]
[{"$f":"IFERROR(INDEX(INDIRECT(\"'INVOICE DATA'!$A$1:$A$\"&invoicecount),SMALL(IF((--(INDIRECT(\"'INVOICE DATA'!$D$1:$D$\"&invoicecount)=STATEMENT!$B$1)),ROW(INDIRECT(\"'INVOICE DATA'!$A$1:$A$\"&invoicecount)),\"\"),ROW(A2)),1),\"\")","v":""},{"$f":"IF(A16=\"\",\"\",VLOOKUP($A16,'INVOICE DATA'!$A:$D,2,FALSE))","v":""},"","",{"$f":"IF(A16=\"\",\"\",VLOOKUP($A16,'INVOICE DATA'!$A:$D,3,FALSE))","v":""}]
[{"$f":"IFERROR(INDEX(INDIRECT(\"'INVOICE DATA'!$A$1:$A$\"&invoicecount),SMALL(IF((--(INDIRECT(\"'INVOICE DATA'!$D$1:$D$\"&invoicecount)=STATEMENT!$B$1)),ROW(INDIRECT(\"'INVOICE DATA'!$A$1:$A$\"&invoicecount)),\"\"),ROW(A3)),1),\"\")","v":""},{"$f":"IF(A17=\"\",\"\",VLOOKUP($A17,'INVOICE DATA'!$A:$D,2,FALSE))","v":""},{"$f":"IF(A17=\"\",\"\",TODAY()-B17)","v":""},"",{"$f":"IF(A17=\"\",\"\",VLOOKUP($A17,'INVOICE DATA'!$A:$D,3,FALSE))","v":""}]
[{"$f":"IFERROR(INDEX(INDIRECT(\"'INVOICE DATA'!$A$1:$A$\"&invoicecount),SMALL(IF((--(INDIRECT(\"'INVOICE DATA'!$D$1:$D$\"&invoicecount)=STATEMENT!$B$1)),ROW(INDIRECT(\"'INVOICE DATA'!$A$1:$A$\"&invoicecount)),\"\"),ROW(A4)),1),\"\")","v":""},{"$f":"IF(A18=\"\",\"\",VLOOKUP($A18,'INVOICE DATA'!$A:$D,2,FALSE))","v":""},"","",{"$f":"IF(A18=\"\",\"\",VLOOKUP($A18,'INVOICE DATA'!$A:$D,3,FALSE))","v":""}]
[{"$f":"IFERROR(INDEX(INDIRECT(\"'INVOICE DATA'!$A$1:$A$\"&invoicecount),SMALL(IF((--(INDIRECT(\"'INVOICE DATA'!$D$1:$D$\"&invoicecount)=STATEMENT!$B$1)),ROW(INDIRECT(\"'INVOICE DATA'!$A$1:$A$\"&invoicecount)),\"\"),ROW(A5)),1),\"\")","v":""},{"$f":"IF(A19=\"\",\"\",VLOOKUP($A19,'INVOICE DATA'!$A:$D,2,FALSE))","v":""},"","",{"$f":"IF(A19=\"\",\"\",VLOOKUP($A19,'INVOICE DATA'!$A:$D,3,FALSE))","v":""}]
[{"$f":"IFERROR(INDEX(INDIRECT(\"'INVOICE DATA'!$A$1:$A$\"&invoicecount),SMALL(IF((--(INDIRECT(\"'INVOICE DATA'!$D$1:$D$\"&invoicecount)=STATEMENT!$B$1)),ROW(INDIRECT(\"'INVOICE DATA'!$A$1:$A$\"&invoicecount)),\"\"),ROW(A6)),1),\"\")","v":""},{"$f":"IF(A20=\"\",\"\",VLOOKUP($A20,'INVOICE DATA'!$A:$D,2,FALSE))","v":""},"","",{"$f":"IF(A20=\"\",\"\",VLOOKUP($A20,'INVOICE DATA'!$A:$D,3,FALSE))","v":""}]
[{"$f":"IFERROR(INDEX(INDIRECT(\"'INVOICE DATA'!$A$1:$A$\"&invoicecount),SMALL(IF((--(INDIRECT(\"'INVOICE DATA'!$D$1:$D$\"&invoicecount)=STATEMENT!$B$1)),ROW(INDIRECT(\"'INVOICE DATA'!$A$1:$A$\"&invoicecount)),\"\"),ROW(A7)),1),\"\")","v":""},{"$f":"IF(A21=\"\",\"\",VLOOKUP($A21,'INVOICE DATA'!$A:$D,2,FALSE))","v":""},"","",{"$f":"IF(A21=\"\",\"\",VLOOKUP($A21,'INVOICE DATA'!$A:$D,3,FALSE))","v":""}]
[{"$f":"IFERROR(INDEX(INDIRECT(\"'INVOICE DATA'!$A$1:$A$\"&invoicecount),SMALL(IF((--(INDIRECT(\"'INVOICE DATA'!$D$1:$D$\"&invoicecount)=STATEMENT!$B$1)),ROW(INDIRECT(\"'INVOICE DATA'!$A$1:$A$\"&invoicecount)),\"\"),ROW(A8)),1),\"\")","v":""},{"$f":"IF(A22=\"\",\"\",VLOOKUP($A22,'INVOICE DATA'!$A:$D,2,FALSE))","v":""},"","",{"$f":"IF(A22=\"\",\"\",VLOOKUP($A22,'INVOICE DATA'!$A:$D,3,FALSE))","v":""}]
[{"$f":"IFERROR(INDEX(INDIRECT(\"'INVOICE DATA'!$A$1:$A$\"&invoicecount),SMALL(IF((--(INDIRECT(\"'INVOICE DATA'!$D$1:$D$\"&invoicecount)=STATEMENT!$B$1)),ROW(INDIRECT(\"'INVOICE DATA'!$A$1:$A$\"&invoicecount)),\"\"),ROW(A9)),1),\"\")","v":""},{"$f":"IF(A23=\"\",\"\",VLOOKUP($A23,'INVOICE DATA'!$A:$D,2,FALSE))","v":""},"","",{"$f":"IF(A23=\"\",\"\",VLOOKUP($A23,'INVOICE DATA'!$A:$D,3,FALSE))","v":""}]
[{"$f":"IFERROR(INDEX(INDIRECT(\"'INVOICE DATA'!$A$1:$A$\"&invoicecount),SMALL(IF((--(INDIRECT(\"'INVOICE DATA'!$D$1:$D$\"&invoicecount)=STATEMENT!$B$1)),ROW(INDIRECT(\"'INVOICE DATA'!$A$1:$A$\"&invoicecount)),\"\"),ROW(A10)),1),\"\")","v":""},{"$f":"IF(A24=\"\",\"\",VLOOKUP($A24,'INVOICE DATA'!$A:$D,2,FALSE))","v":""},"","",{"$f":"IF(A24=\"\",\"\",VLOOKUP($A24,'INVOICE DATA'!$A:$D,3,FALSE))","v":""}]
[{"$f":"IFERROR(INDEX(INDIRECT(\"'INVOICE DATA'!$A$1:$A$\"&invoicecount),SMALL(IF((--(INDIRECT(\"'INVOICE DATA'!$D$1:$D$\"&invoicecount)=STATEMENT!$B$1)),ROW(INDIRECT(\"'INVOICE DATA'!$A$1:$A$\"&invoicecount)),\"\"),ROW(A11)),1),\"\")","v":""},{"$f":"IF(A25=\"\",\"\",VLOOKUP($A25,'INVOICE DATA'!$A:$D,2,FALSE))","v":""},"","",{"$f":"IF(A25=\"\",\"\",VLOOKUP($A25,'INVOICE DATA'!$A:$D,3,FALSE))","v":""}]
[{"$f":"IFERROR(INDEX(INDIRECT(\"'INVOICE DATA'!$A$1:$A$\"&invoicecount),SMALL(IF((--(INDIRECT(\"'INVOICE DATA'!$D$1:$D$\"&invoicecount)=STATEMENT!$B$1)),ROW(INDIRECT(\"'INVOICE DATA'!$A$1:$A$\"&invoicecount)),\"\"),ROW(A12)),1),\"\")","v":""},{"$f":"IF(A26=\"\",\"\",VLOOKUP($A26,'INVOICE DATA'!$A:$D,2,FALSE))","v":""},"","",{"$f":"IF(A26=\"\",\"\",VLOOKUP($A26,'INVOICE DATA'!$A:$D,3,FALSE))","v":""}]
[{"$f":"IFERROR(INDEX(INDIRECT(\"'INVOICE DATA'!$A$1:$A$\"&invoicecount),SMALL(IF((--(INDIRECT(\"'INVOICE DATA'!$D$1:$D$\"&invoicecount)=STATEMENT!$B$1)),ROW(INDIRECT(\"'INVOICE DATA'!$A$1:$A$\"&invoicecount)),\"\"),ROW(A13)),1),\"\")","v":""},{"$f":"IF(A27=\"\",\"\",VLOOKUP($A27,'INVOICE DATA'!$A:$D,2,FALSE))","v":""},"","",{"$f":"IF(A27=\"\",\"\",VLOOKUP($A27,'INVOICE DATA'!$A:$D,3,FALSE))","v":""}]
[{"$f":"IFERROR(INDEX(INDIRECT(\"'INVOICE DATA'!$A$1:$A$\"&invoicecount),SMALL(IF((--(INDIRECT(\"'INVOICE DATA'!$D$1:$D$\"&invoicecount)=STATEMENT!$B$1)),ROW(INDIRECT(\"'INVOICE DATA'!$A$1:$A$\"&invoicecount)),\"\"),ROW(A14)),1),\"\")","v":""},{"$f":"IF(A28=\"\",\"\",VLOOKUP($A28,'INVOICE DATA'!$A:$D,2,FALSE))","v":""},"","",{"$f":"IF(A28=\"\",\"\",VLOOKUP($A28,'INVOICE DATA'!$A:$D,3,FALSE))","v":""}]
[{"$f":"IFERROR(INDEX(INDIRECT(\"'INVOICE DATA'!$A$1:$A$\"&invoicecount),SMALL(IF((--(INDIRECT(\"'INVOICE DATA'!$D$1:$D$\"&invoicecount)=STATEMENT!$B$1)),ROW(INDIRECT(\"'INVOICE DATA'!$A$1:$A$\"&invoicecount)),\"\"),ROW(A15)),1),\"\")","v":""},{"$f":"IF(A29=\"\",\"\",VLOOKUP($A29,'INVOICE DATA'!$A:$D,2,FALSE))","v":""},{"$f":"IF(A29=\"\",\"\",TODAY()-B29)","v":""},{"$f":"IF(A29=\"\",\"\",VLOOKUP(C29,AgingTable,2))","v":""},{"$f":"IF(A29=\"\",\"\",VLOOKUP($A29,'INVOICE DATA'!$A:$D,3,FALSE))","v":""}]
[{"$f":"IFERROR(INDEX(INDIRECT(\"'INVOICE DATA'!$A$1:$A$\"&invoicecount),SMALL(IF((--(INDIRECT(\"'INVOICE DATA'!$D$1:$D$\"&invoicecount)=STATEMENT!$B$1)),ROW(INDIRECT(\"'INVOICE DATA'!$A$1:$A$\"&invoicecount)),\"\"),ROW(A16)),1),\"\")","v":""},{"$f":"IF(A30=\"\",\"\",VLOOKUP($A30,'INVOICE DATA'!$A:$D,2,FALSE))","v":""},"","",{"$f":"IF(A30=\"\",\"\",VLOOKUP($A30,'INVOICE DATA'!$A:$D,3,FALSE))","v":""}]
[{"$f":"IFERROR(INDEX(INDIRECT(\"'INVOICE DATA'!$A$1:$A$\"&invoicecount),SMALL(IF((--(INDIRECT(\"'INVOICE DATA'!$D$1:$D$\"&invoicecount)=STATEMENT!$B$1)),ROW(INDIRECT(\"'INVOICE DATA'!$A$1:$A$\"&invoicecount)),\"\"),ROW(A17)),1),\"\")","v":""},{"$f":"IF(A31=\"\",\"\",VLOOKUP($A31,'INVOICE DATA'!$A:$D,2,FALSE))","v":""},"","",{"$f":"IF(A31=\"\",\"\",VLOOKUP($A31,'INVOICE DATA'!$A:$D,3,FALSE))","v":""}]
[{"$f":"IFERROR(INDEX(INDIRECT(\"'INVOICE DATA'!$A$1:$A$\"&invoicecount),SMALL(IF((--(INDIRECT(\"'INVOICE DATA'!$D$1:$D$\"&invoicecount)=STATEMENT!$B$1)),ROW(INDIRECT(\"'INVOICE DATA'!$A$1:$A$\"&invoicecount)),\"\"),ROW(A18)),1),\"\")","v":""},{"$f":"IF(A32=\"\",\"\",VLOOKUP($A32,'INVOICE DATA'!$A:$D,2,FALSE))","v":""},"","",{"$f":"IF(A32=\"\",\"\",VLOOKUP($A32,'INVOICE DATA'!$A:$D,3,FALSE))","v":""}]
[{"$f":"IFERROR(INDEX(INDIRECT(\"'INVOICE DATA'!$A$1:$A$\"&invoicecount),SMALL(IF((--(INDIRECT(\"'INVOICE DATA'!$D$1:$D$\"&invoicecount)=STATEMENT!$B$1)),ROW(INDIRECT(\"'INVOICE DATA'!$A$1:$A$\"&invoicecount)),\"\"),ROW(A19)),1),\"\")","v":""},{"$f":"IF(A33=\"\",\"\",VLOOKUP($A33,'INVOICE DATA'!$A:$D,2,FALSE))","v":""},"","",{"$f":"IF(A33=\"\",\"\",VLOOKUP($A33,'INVOICE DATA'!$A:$D,3,FALSE))","v":""}]
[{"$f":"IFERROR(INDEX(INDIRECT(\"'INVOICE DATA'!$A$1:$A$\"&invoicecount),SMALL(IF((--(INDIRECT(\"'INVOICE DATA'!$D$1:$D$\"&invoicecount)=STATEMENT!$B$1)),ROW(INDIRECT(\"'INVOICE DATA'!$A$1:$A$\"&invoicecount)),\"\"),ROW(A20)),1),\"\")","v":""},{"$f":"IF(A34=\"\",\"\",VLOOKUP($A34,'INVOICE DATA'!$A:$D,2,FALSE))","v":""},"","",{"$f":"IF(A34=\"\",\"\",VLOOKUP($A34,'INVOICE DATA'!$A:$D,3,FALSE))","v":""}]
[{"$f":"IFERROR(INDEX(INDIRECT(\"'INVOICE DATA'!$A$1:$A$\"&invoicecount),SMALL(IF((--(INDIRECT(\"'INVOICE DATA'!$D$1:$D$\"&invoicecount)=STATEMENT!$B$1)),ROW(INDIRECT(\"'INVOICE DATA'!$A$1:$A$\"&invoicecount)),\"\"),ROW(A21)),1),\"\")","v":""},{"$f":"IF(A35=\"\",\"\",VLOOKUP($A35,'INVOICE DATA'!$A:$D,2,FALSE))","v":""},"","",{"$f":"IF(A35=\"\",\"\",VLOOKUP($A35,'INVOICE DATA'!$A:$D,3,FALSE))","v":""}]
[{"$f":"IFERROR(INDEX(INDIRECT(\"'INVOICE DATA'!$A$1:$A$\"&invoicecount),SMALL(IF((--(INDIRECT(\"'INVOICE DATA'!$D$1:$D$\"&invoicecount)=STATEMENT!$B$1)),ROW(INDIRECT(\"'INVOICE DATA'!$A$1:$A$\"&invoicecount)),\"\"),ROW(A22)),1),\"\")","v":""},{"$f":"IF(A36=\"\",\"\",VLOOKUP($A36,'INVOICE DATA'!$A:$D,2,FALSE))","v":""},"","",{"$f":"IF(A36=\"\",\"\",VLOOKUP($A36,'INVOICE DATA'!$A:$D,3,FALSE))","v":""}]
[{"$f":"IFERROR(INDEX(INDIRECT(\"'INVOICE DATA'!$A$1:$A$\"&invoicecount),SMALL(IF((--(INDIRECT(\"'INVOICE DATA'!$D$1:$D$\"&invoicecount)=STATEMENT!$B$1)),ROW(INDIRECT(\"'INVOICE DATA'!$A$1:$A$\"&invoicecount)),\"\"),ROW(A23)),1),\"\")","v":""},{"$f":"IF(A37=\"\",\"\",VLOOKUP($A37,'INVOICE DATA'!$A:$D,2,FALSE))","v":""},"","",{"$f":"IF(A37=\"\",\"\",VLOOKUP($A37,'INVOICE DATA'!$A:$D,3,FALSE))","v":""}]
[{"$f":"IFERROR(INDEX(INDIRECT(\"'INVOICE DATA'!$A$1:$A$\"&invoicecount),SMALL(IF((--(INDIRECT(\"'INVOICE DATA'!$D$1:$D$\"&invoicecount)=STATEMENT!$B$1)),ROW(INDIRECT(\"'INVOICE DATA'!$A$1:$A$\"&invoicecount)),\"\"),ROW(A24)),1),\"\")","v":""},{"$f":"IF(A38=\"\",\"\",VLOOKUP($A38,'INVOICE DATA'!$A:$D,2,FALSE))","v":""},{"$f":"IF(A38=\"\",\"\",TODAY()-B38)","v":""},{"$f":"IF(A38=\"\",\"\",VLOOKUP(C38,AgingTable,2))","v":""},{"$f":"IF(A38=\"\",\"\",VLOOKUP($A38,'INVOICE DATA'!$A:$D,3,FALSE))","v":""}]
[{"$f":"IFERROR(INDEX(INDIRECT(\"'INVOICE DATA'!$A$1:$A$\"&invoicecount),SMALL(IF((--(INDIRECT(\"'INVOICE DATA'!$D$1:$D$\"&invoicecount)=STATEMENT!$B$1)),ROW(INDIRECT(\"'INVOICE DATA'!$A$1:$A$\"&invoicecount)),\"\"),ROW(A25)),1),\"\")","v":""},{"$f":"IF(A39=\"\",\"\",VLOOKUP($A39,'INVOICE DATA'!$A:$D,2,FALSE))","v":""},"","",{"$f":"IF(A39=\"\",\"\",VLOOKUP($A39,'INVOICE DATA'!$A:$D,3,FALSE))","v":""}]
[{"$f":"IFERROR(INDEX(INDIRECT(\"'INVOICE DATA'!$A$1:$A$\"&invoicecount),SMALL(IF((--(INDIRECT(\"'INVOICE DATA'!$D$1:$D$\"&invoicecount)=STATEMENT!$B$1)),ROW(INDIRECT(\"'INVOICE DATA'!$A$1:$A$\"&invoicecount)),\"\"),ROW(A26)),1),\"\")","v":""},{"$f":"IF(A40=\"\",\"\",VLOOKUP($A40,'INVOICE DATA'!$A:$D,2,FALSE))","v":""},"","",{"$f":"IF(A40=\"\",\"\",VLOOKUP($A40,'INVOICE DATA'!$A:$D,3,FALSE))","v":""}]
[{"$f":"IFERROR(INDEX(INDIRECT(\"'INVOICE DATA'!$A$1:$A$\"&invoicecount),SMALL(IF((--(INDIRECT(\"'INVOICE DATA'!$D$1:$D$\"&invoicecount)=STATEMENT!$B$1)),ROW(INDIRECT(\"'INVOICE DATA'!$A$1:$A$\"&invoicecount)),\"\"),ROW(A27)),1),\"\")","v":""},{"$f":"IF(A41=\"\",\"\",VLOOKUP($A41,'INVOICE DATA'!$A:$D,2,FALSE))","v":""},"","",{"$f":"IF(A41=\"\",\"\",VLOOKUP($A41,'INVOICE DATA'!$A:$D,3,FALSE))","v":""}]
[{"$f":"IFERROR(INDEX(INDIRECT(\"'INVOICE DATA'!$A$1:$A$\"&invoicecount),SMALL(IF((--(INDIRECT(\"'INVOICE DATA'!$D$1:$D$\"&invoicecount)=STATEMENT!$B$1)),ROW(INDIRECT(\"'INVOICE DATA'!$A$1:$A$\"&invoicecount)),\"\"),ROW(A28)),1),\"\")","v":""},{"$f":"IF(A42=\"\",\"\",VLOOKUP($A42,'INVOICE DATA'!$A:$D,2,FALSE))","v":""},"","",{"$f":"IF(A42=\"\",\"\",VLOOKUP($A42,'INVOICE DATA'!$A:$D,3,FALSE))","v":""}]
[{"$f":"IFERROR(INDEX(INDIRECT(\"'INVOICE DATA'!$A$1:$A$\"&invoicecount),SMALL(IF((--(INDIRECT(\"'INVOICE DATA'!$D$1:$D$\"&invoicecount)=STATEMENT!$B$1)),ROW(INDIRECT(\"'INVOICE DATA'!$A$1:$A$\"&invoicecount)),\"\"),ROW(A29)),1),\"\")","v":""},{"$f":"IF(A43=\"\",\"\",VLOOKUP($A43,'INVOICE DATA'!$A:$D,2,FALSE))","v":""},"","",{"$f":"IF(A43=\"\",\"\",VLOOKUP($A43,'INVOICE DATA'!$A:$D,3,FALSE))","v":""}]
[{"$f":"IFERROR(INDEX(INDIRECT(\"'INVOICE DATA'!$A$1:$A$\"&invoicecount),SMALL(IF((--(INDIRECT(\"'INVOICE DATA'!$D$1:$D$\"&invoicecount)=STATEMENT!$B$1)),ROW(INDIRECT(\"'INVOICE DATA'!$A$1:$A$\"&invoicecount)),\"\"),ROW(A30)),1),\"\")","v":""},{"$f":"IF(A44=\"\",\"\",VLOOKUP($A44,'INVOICE DATA'!$A:$D,2,FALSE))","v":""},"","",{"$f":"IF(A44=\"\",\"\",VLOOKUP($A44,'INVOICE DATA'!$A:$D,3,FALSE))","v":""}]
["Current","30+","60+","90+","Total"]
[{"$f":"SUMIF($D15:$D44,A$45,$E15:$E44)+SUMIF($D49:$D78,A$45,$E49:$E78)+SUMIF($D83:$D112,A$45,$E83:$E112)+SUMIF($D117:$D146,A$45,$E117:$E146)+SUMIF($D151:$D180,A$45,$E151:$E180)","v":0},{"$f":"SUMIF($D15:$D44,B$45,$E15:$E44)+SUMIF($D49:$D78,B$45,$E49:$E78)+SUMIF($D83:$D112,B$45,$E83:$E112)+SUMIF($D117:$D146,B$45,$E117:$E146)+SUMIF($D151:$D180,B$45,$E151:$E180)","v":0},{"$f":"SUMIF($D15:$D44,C$45,$E15:$E44)+SUMIF($D49:$D78,C$45,$E49:$E78)+SUMIF($D83:$D112,C$45,$E83:$E112)+SUMIF($D117:$D146,C$45,$E117:$E146)+SUMIF($D151:$D180,C$45,$E151:$E180)","v":0},{"$f":"SUMIF($D15:$D44,D$45,$E15:$E44)+SUMIF($D49:$D78,D$45,$E49:$E78)+SUMIF($D83:$D112,D$45,$E83:$E112)+SUMIF($D117:$D146,D$45,$E117:$E146)+SUMIF($D151:$D180,D$45,$E151:$E180)","v":40},{"$f":"SUM(A46:D46)","v":40}]
[]
[]
[{"$f":"IFERROR(INDEX(INDIRECT(\"'INVOICE DATA'!$A$1:$A$\"&invoicecount),SMALL(IF((--(INDIRECT(\"'INVOICE DATA'!$D$1:$D$\"&invoicecount)=STATEMENT!$B$1)),ROW(INDIRECT(\"'INVOICE DATA'!$A$1:$A$\"&invoicecount)),\"\"),ROW(A31)),1),\"\")","v":""},{"$f":"IF(A49=\"\",\"\",VLOOKUP($A49,'INVOICE DATA'!$A:$D,2,FALSE))","v":""},{"$f":"IF(A49=\"\",\"\",TODAY()-B49)","v":""},{"$f":"IF(A49=\"\",\"\",VLOOKUP(C49,AgingTable,2))","v":""},{"$f":"IF(A49=\"\",\"\",VLOOKUP($A49,'INVOICE DATA'!$A:$D,3,FALSE))","v":""}]
[{"$f":"IFERROR(INDEX(INDIRECT(\"'INVOICE DATA'!$A$1:$A$\"&invoicecount),SMALL(IF((--(INDIRECT(\"'INVOICE DATA'!$D$1:$D$\"&invoicecount)=STATEMENT!$B$1)),ROW(INDIRECT(\"'INVOICE DATA'!$A$1:$A$\"&invoicecount)),\"\"),ROW(A32)),1),\"\")","v":""},{"$f":"IF(A50=\"\",\"\",VLOOKUP($A50,'INVOICE DATA'!$A:$D,2,FALSE))","v":""},"","",{"$f":"IF(A50=\"\",\"\",VLOOKUP($A50,'INVOICE DATA'!$A:$D,3,FALSE))","v":""}]
[{"$f":"IFERROR(INDEX(INDIRECT(\"'INVOICE DATA'!$A$1:$A$\"&invoicecount),SMALL(IF((--(INDIRECT(\"'INVOICE DATA'!$D$1:$D$\"&invoicecount)=STATEMENT!$B$1)),ROW(INDIRECT(\"'INVOICE DATA'!$A$1:$A$\"&invoicecount)),\"\"),ROW(A33)),1),\"\")","v":""},{"$f":"IF(A51=\"\",\"\",VLOOKUP($A51,'INVOICE DATA'!$A:$D,2,FALSE))","v":""},"","",{"$f":"IF(A51=\"\",\"\",VLOOKUP($A51,'INVOICE DATA'!$A:$D,3,FALSE))","v":""}]
[{"$f":"IFERROR(INDEX(INDIRECT(\"'INVOICE DATA'!$A$1:$A$\"&invoicecount),SMALL(IF((--(INDIRECT(\"'INVOICE DATA'!$D$1:$D$\"&invoicecount)=STATEMENT!$B$1)),ROW(INDIRECT(\"'INVOICE DATA'!$A$1:$A$\"&invoicecount)),\"\"),ROW(A34)),1),\"\")","v":""},{"$f":"IF(A52=\"\",\"\",VLOOKUP($A52,'INVOICE DATA'!$A:$D,2,FALSE))","v":""},"","",{"$f":"IF(A52=\"\",\"\",VLOOKUP($A52,'INVOICE DATA'!$A:$D,3,FALSE))","v":""}]
[{"$f":"IFERROR(INDEX(INDIRECT(\"'INVOICE DATA'!$A$1:$A$\"&invoicecount),SMALL(IF((--(INDIRECT(\"'INVOICE DATA'!$D$1:$D$\"&invoicecount)=STATEMENT!$B$1)),ROW(INDIRECT(\"'INVOICE DATA'!$A$1:$A$\"&invoicecount)),\"\"),ROW(A35)),1),\"\")","v":""},{"$f":"IF(A53=\"\",\"\",VLOOKUP($A53,'INVOICE DATA'!$A:$D,2,FALSE))","v":""},"","",{"$f":"IF(A53=\"\",\"\",VLOOKUP($A53,'INVOICE DATA'!$A:$D,3,FALSE))","v":""}]
[{"$f":"IFERROR(INDEX(INDIRECT(\"'INVOICE DATA'!$A$1:$A$\"&invoicecount),SMALL(IF((--(INDIRECT(\"'INVOICE DATA'!$D$1:$D$\"&invoicecount)=STATEMENT!$B$1)),ROW(INDIRECT(\"'INVOICE DATA'!$A$1:$A$\"&invoicecount)),\"\"),ROW(A36)),1),\"\")","v":""},{"$f":"IF(A54=\"\",\"\",VLOOKUP($A54,'INVOICE DATA'!$A:$D,2,FALSE))","v":""},"","",{"$f":"IF(A54=\"\",\"\",VLOOKUP($A54,'INVOICE DATA'!$A:$D,3,FALSE))","v":""}]
[{"$f":"IFERROR(INDEX(INDIRECT(\"'INVOICE DATA'!$A$1:$A$\"&invoicecount),SMALL(IF((--(INDIRECT(\"'INVOICE DATA'!$D$1:$D$\"&invoicecount)=STATEMENT!$B$1)),ROW(INDIRECT(\"'INVOICE DATA'!$A$1:$A$\"&invoicecount)),\"\"),ROW(A37)),1),\"\")","v":""},{"$f":"IF(A55=\"\",\"\",VLOOKUP($A55,'INVOICE DATA'!$A:$D,2,FALSE))","v":""},"","",{"$f":"IF(A55=\"\",\"\",VLOOKUP($A55,'INVOICE DATA'!$A:$D,3,FALSE))","v":""}]
[{"$f":"IFERROR(INDEX(INDIRECT(\"'INVOICE DATA'!$A$1:$A$\"&invoicecount),SMALL(IF((--(INDIRECT(\"'INVOICE DATA'!$D$1:$D$\"&invoicecount)=STATEMENT!$B$1)),ROW(INDIRECT(\"'INVOICE DATA'!$A$1:$A$\"&invoicecount)),\"\"),ROW(A38)),1),\"\")","v":""},{"$f":"IF(A56=\"\",\"\",VLOOKUP($A56,'INVOICE DATA'!$A:$D,2,FALSE))","v":""},"","",{"$f":"IF(A56=\"\",\"\",VLOOKUP($A56,'INVOICE DATA'!$A:$D,3,FALSE))","v":""}]
[{"$f":"IFERROR(INDEX(INDIRECT(\"'INVOICE DATA'!$A$1:$A$\"&invoicecount),SMALL(IF((--(INDIRECT(\"'INVOICE DATA'!$D$1:$D$\"&invoicecount)=STATEMENT!$B$1)),ROW(INDIRECT(\"'INVOICE DATA'!$A$1:$A$\"&invoicecount)),\"\"),ROW(A39)),1),\"\")","v":""},{"$f":"IF(A57=\"\",\"\",VLOOKUP($A57,'INVOICE DATA'!$A:$D,2,FALSE))","v":""},"","",{"$f":"IF(A57=\"\",\"\",VLOOKUP($A57,'INVOICE DATA'!$A:$D,3,FALSE))","v":""}]
[{"$f":"IFERROR(INDEX(INDIRECT(\"'INVOICE DATA'!$A$1:$A$\"&invoicecount),SMALL(IF((--(INDIRECT(\"'INVOICE DATA'!$D$1:$D$\"&invoicecount)=STATEMENT!$B$1)),ROW(INDIRECT(\"'INVOICE DATA'!$A$1:$A$\"&invoicecount)),\"\"),ROW(A40)),1),\"\")","v":""},{"$f":"IF(A58=\"\",\"\",VLOOKUP($A58,'INVOICE DATA'!$A:$D,2,FALSE))","v":""},"","",{"$f":"IF(A58=\"\",\"\",VLOOKUP($A58,'INVOICE DATA'!$A:$D,3,FALSE))","v":""}]
[{"$f":"IFERROR(INDEX(INDIRECT(\"'INVOICE DATA'!$A$1:$A$\"&invoicecount),SMALL(IF((--(INDIRECT(\"'INVOICE DATA'!$D$1:$D$\"&invoicecount)=STATEMENT!$B$1)),ROW(INDIRECT(\"'INVOICE DATA'!$A$1:$A$\"&invoicecount)),\"\"),ROW(A41)),1),\"\")","v":""},{"$f":"IF(A59=\"\",\"\",VLOOKUP($A59,'INVOICE DATA'!$A:$D,2,FALSE))","v":""},"","",{"$f":"IF(A59=\"\",\"\",VLOOKUP($A59,'INVOICE DATA'!$A:$D,3,FALSE))","v":""}]
[{"$f":"IFERROR(INDEX(INDIRECT(\"'INVOICE DATA'!$A$1:$A$\"&invoicecount),SMALL(IF((--(INDIRECT(\"'INVOICE DATA'!$D$1:$D$\"&invoicecount)=STATEMENT!$B$1)),ROW(INDIRECT(\"'INVOICE DATA'!$A$1:$A$\"&invoicecount)),\"\"),ROW(A42)),1),\"\")","v":""},{"$f":"IF(A60=\"\",\"\",VLOOKUP($A60,'INVOICE DATA'!$A:$D,2,FALSE))","v":""},"","",{"$f":"IF(A60=\"\",\"\",VLOOKUP($A60,'INVOICE DATA'!$A:$D,3,FALSE))","v":""}]
{"$rows_left_out":123}
{"sheet":"INVOICE DATA","index":1,"n_rows":5,"n_cols":4,"rows_kept":5,"cut":false,"hidden":false,"merged":[]}
["Invoice #","Date","Amount","Customer"]
[123,"2017-01-01",10,"Company A"]
[124,"2017-03-15",20,"Company B"]
[125,"2017-04-10",30,"Company A"]
[126,"2017-05-01",40,"Company D"]

{"sheet":"CUSTOMER DATA","index":2,"n_rows":5,"n_cols":6,"rows_kept":5,"cut":false,"hidden":false,"merged":[]}
["Customer","Address","Address Line 2","City","Province","Postal/Zip"]
["Company A","Address Line 1","Address Line 2","City","Province","POSTAL CODE"]
["Company B","Address Line 1",null,"City","Province","POSTAL CODE"]
["Company C","Address Line 1","Address Line 2","City","Province","POSTAL CODE"]
["Company D","Address Line 1",null,"City","Province","POSTAL CODE"]